Skip to content

fix(deps): update all non-major dependencies (main) - autoclosed #5749

fix(deps): update all non-major dependencies (main) - autoclosed

fix(deps): update all non-major dependencies (main) - autoclosed #5749

GitHub Actions / IT Tests report-windows-latest-npm failed May 8, 2024 in 0s

22 passed, 1 failed and 0 skipped

Tests failed

Report Passed Failed Skipped Time
@ama-sdk/create/dist-test/it-report.xml 6✅ 506s
@ama-sdk/schematics/dist-test/it-report.xml 6ms
@o3r/analytics/dist-test/it-report.xml 1✅ 110s
@o3r/apis-manager/dist-test/it-report.xml 1✅ 106s
@o3r/components/dist-test/it-report.xml 1✅ 109s
@o3r/configuration/dist-test/it-report.xml 1✅ 122s
@o3r/core/dist-test/it-report.xml 1✅ 906s
@o3r/create/dist-test/it-report.xml 1✅ 1❌ 148s
@o3r/design/dist-test/it-report.xml 1✅ 109s
@o3r/eslint-config-otter/dist-test/it-report.xml 2✅ 392s
@o3r/extractors/dist-test/it-report.xml 1✅ 232s
@o3r/localization/dist-test/it-report.xml 1✅ 140s
@o3r/rules-engine/dist-test/it-report.xml 1✅ 133s
@o3r/stylelint-plugin/dist-test/it-report.xml 1✅ 122s
@o3r/styling/dist-test/it-report.xml 1✅ 165s
@o3r/testing/dist-test/it-report.xml 2✅ 206s

✅ @ama-sdk/create/dist-test/it-report.xml

6 tests were completed in 506s with 6 passed, 0 failed and 0 skipped.

Test suite Passed Failed Skipped Time
Create new sdk command 6✅ 494s

✅ Create new sdk command

Create new sdk command should generate a light SDK when the specification is provided
  ✅ Create new sdk command should generate a light SDK when the specification is provided
Create new sdk command should generate a full SDK when the specification is provided
  ✅ Create new sdk command should generate a full SDK when the specification is provided
Create new sdk command should generate an SDK with no package scope
  ✅ Create new sdk command should generate an SDK with no package scope
Create new sdk command should generate an empty SDK ready to be used
  ✅ Create new sdk command should generate an empty SDK ready to be used
Create new sdk command should fail when there is an error
  ✅ Create new sdk command should fail when there is an error
Create new sdk command should use pinned versions when --exact-o3r-version is used
  ✅ Create new sdk command should use pinned versions when --exact-o3r-version is used

✅ @ama-sdk/schematics/dist-test/it-report.xml

No tests found

✅ @o3r/analytics/dist-test/it-report.xml

1 tests were completed in 110s with 1 passed, 0 failed and 0 skipped.

Test suite Passed Failed Skipped Time
new otter application with analytics 1✅ 91s

✅ new otter application with analytics

new otter application with analytics should add analytics to existing application
  ✅ new otter application with analytics should add analytics to existing application

✅ @o3r/apis-manager/dist-test/it-report.xml

1 tests were completed in 106s with 1 passed, 0 failed and 0 skipped.

Test suite Passed Failed Skipped Time
new otter application with apis-manager 1✅ 93s

✅ new otter application with apis-manager

new otter application with apis-manager should add apis-manager to existing application
  ✅ new otter application with apis-manager should add apis-manager to existing application

✅ @o3r/components/dist-test/it-report.xml

1 tests were completed in 109s with 1 passed, 0 failed and 0 skipped.

Test suite Passed Failed Skipped Time
new otter application with components 1✅ 87s

✅ new otter application with components

new otter application with components should add components to existing application
  ✅ new otter application with components should add components to existing application

✅ @o3r/configuration/dist-test/it-report.xml

1 tests were completed in 122s with 1 passed, 0 failed and 0 skipped.

Test suite Passed Failed Skipped Time
new otter application with configuration 1✅ 104s

✅ new otter application with configuration

new otter application with configuration should add configuration to existing application
  ✅ new otter application with configuration should add configuration to existing application

✅ @o3r/core/dist-test/it-report.xml

1 tests were completed in 906s with 1 passed, 0 failed and 0 skipped.

Test suite Passed Failed Skipped Time
new otter application 1✅ 887s

✅ new otter application

new otter application should build empty app
  ✅ new otter application should build empty app

❌ @o3r/create/dist-test/it-report.xml

2 tests were completed in 148s with 1 passed, 1 failed and 0 skipped.

Test suite Passed Failed Skipped Time
Create new otter project command 1✅ 1❌ 140s

❌ Create new otter project command

Create new otter project command should generate a project with an application
  ✅ Create new otter project command should generate a project with an application
Create new otter project command should generate a project with an application with --exact-o3r-version
  ❌ Create new otter project command should generate a project with an application with --exact-o3r-version
	Error: expect(received).not.toThrow()

✅ @o3r/design/dist-test/it-report.xml

1 tests were completed in 109s with 1 passed, 0 failed and 0 skipped.

Test suite Passed Failed Skipped Time
new otter application with Design 1✅ 93s

✅ new otter application with Design

new otter application with Design should add design to existing application
  ✅ new otter application with Design should add design to existing application

✅ @o3r/eslint-config-otter/dist-test/it-report.xml

2 tests were completed in 392s with 2 passed, 0 failed and 0 skipped.

Test suite Passed Failed Skipped Time
new otter application with eslint-config 2✅ 376s

✅ new otter application with eslint-config

new otter application with eslint-config should add eslint-config to existing application
  ✅ new otter application with eslint-config should add eslint-config to existing application
new otter application with eslint-config should add eslint-config to new library
  ✅ new otter application with eslint-config should add eslint-config to new library

✅ @o3r/extractors/dist-test/it-report.xml

1 tests were completed in 232s with 1 passed, 0 failed and 0 skipped.

Test suite Passed Failed Skipped Time
new otter application with extractors 1✅ 215s

✅ new otter application with extractors

new otter application with extractors should add extractors to existing application
  ✅ new otter application with extractors should add extractors to existing application

✅ @o3r/localization/dist-test/it-report.xml

1 tests were completed in 140s with 1 passed, 0 failed and 0 skipped.

Test suite Passed Failed Skipped Time
new otter application with localization 1✅ 120s

✅ new otter application with localization

new otter application with localization should add localization to existing application
  ✅ new otter application with localization should add localization to existing application

✅ @o3r/rules-engine/dist-test/it-report.xml

1 tests were completed in 133s with 1 passed, 0 failed and 0 skipped.

Test suite Passed Failed Skipped Time
new otter application with rules-engine 1✅ 115s

✅ new otter application with rules-engine

new otter application with rules-engine should add rules engine to existing application
  ✅ new otter application with rules-engine should add rules engine to existing application

✅ @o3r/stylelint-plugin/dist-test/it-report.xml

1 tests were completed in 122s with 1 passed, 0 failed and 0 skipped.

Test suite Passed Failed Skipped Time
new otter application with stylelint-plugin 1✅ 104s

✅ new otter application with stylelint-plugin

new otter application with stylelint-plugin should add stylelint-plugin to existing application
  ✅ new otter application with stylelint-plugin should add stylelint-plugin to existing application

✅ @o3r/styling/dist-test/it-report.xml

1 tests were completed in 165s with 1 passed, 0 failed and 0 skipped.

Test suite Passed Failed Skipped Time
new otter application with styling 1✅ 146s

✅ new otter application with styling

new otter application with styling should add styling to existing application
  ✅ new otter application with styling should add styling to existing application

✅ @o3r/testing/dist-test/it-report.xml

2 tests were completed in 206s with 2 passed, 0 failed and 0 skipped.

Test suite Passed Failed Skipped Time
new otter application with testing 2✅ 190s

✅ new otter application with testing

new otter application with testing should add testing to existing application
  ✅ new otter application with testing should add testing to existing application
new otter application with testing should add testing to existing application and fixture to component
  ✅ new otter application with testing should add testing to existing application and fixture to component

Annotations

Check failure on line 83 in packages/@o3r/test-helpers/src/utilities/package-manager.ts

See this annotation in the file changed.

@github-actions github-actions / IT Tests report-windows-latest-npm

Create new otter project command ► Create new otter project command should generate a project with an application with --exact-o3r-version ► Create new otter project command should generate a project with an application with --exact-o3r-version

Failed test found in:
  @o3r/create/dist-test/it-report.xml
Error:
  Error: expect(received).not.toThrow()
Raw output
Error: expect(received).not.toThrow()

Error name:    "Error"
Error message: "Command failed: npm create @o3r@999.0.1715052731233 my-project -- --package-manager npm --skip-confirmation --exact-o3r-version --yarn-version 4.2.1
STDERR:
- Installing packages (npm)...
✔ Packages installed successfully.
- Determining package manager...
ℹ Using package manager: npm
- Loading package information from registry...
✖ Unable to fetch package information for '@o3r/core@999.0.1715052731233': No matching version found for @o3r/core@999.0.1715052731233.
npm ERR! code 3
npm ERR! path D:\\a\\otter\\it-tests\\test-create-app1
npm ERR! command failed
npm ERR! command C:\\Windows\\system32\\cmd.exe /d /s /c create my-project --package-manager npm --skip-confirmation --exact-o3r-version --yarn-version 4.2.1·
npm ERR! A complete log of this run can be found in: D:\\a\\otter\\otter\\.cache\\test-app\\npm-cache\\_logs\\2024-05-08T21_45_50_904Z-debug-0.log·
OUTPUT:
,·
                        &BPPPB                    &                    &BPGB&
                      #Y7!!!!!J#    &#BGP5YYJJ??????????JJYY5PG#&     P7!!!!7JG
                     #!!!!!!!!!7Y5J?7!!!!!!!!!!!!!!!!!!!!!!!!!!!7?JPB5!!!!!!!!!G
                     #!!!!!!!!!!!!!!!!!!!!!!!!!!!!!!!!!!!!!!!!!!!!!!!!!!!!!!!!~5
                      BJ!!!!!!!!!!!!!!!!!!!!!!!!!!!!!!!!!!!!!!!!!!!!!!!!!!!!!?5
                       &?!!!!!!!!!!!!!!!!!!!!!!!!!!!!!!!!!!!!!!!!!!!!!!!!!!!7B
                      G?!!!!!!!!!!!!!!!!!!!!!!!!!!!!!!!!!!!!!!!!!!!!!!!!!!!!!75&
                    #J!!!!!!!!!!!!!!!!!!!!!!!!!!!!!!!!!!!!!!!!!!!!!!!!!!!!!!!!!?B
                   P7!!!!!!!!!!!!!!!!!!!!!!!!!!!!!!!!!!!!!!!!!!!!!!!!!!!!!!!!!!!!Y&
                 &Y!!!!!!!!!!!!7??!!!!!!!!!!!!!!!!!!!!!!!!!!!!!!!!777!!!!!!!!!!!!!?#
                &?!!!!!!!!!!!!J&J&#7!!!!!!!!7?Y5PPPP55J7!!!!!!!!!5B?&P!!!!!!!!!!!!!7B
               &?!!!!!!!!!!!!!?B##P!!!!!!!!!5          &?!!!!!!!!Y&&&P!!!!!!!!!!!!!!!B
               J!!!!!!!!J7!!!!!!7!!!!!!!!!!!7YB&      BY!!!!!!!!!!777!!!!!!!?7!!!!!!!7#
              P!!!!!!!!YB!!!!!!!!!!!!!!!!!!!!!!7JY5YJ?!!!!!!!!!!!!!!!!!!!!!!YG!!!!!!!!J
             &7!!!!!!!!GG!!!!!!!!!!!!!!!!!!!!!!!!!!!!!!!!!!!!!!!!!!!!!!!!!!!J&7!!!!!!!!B
             B!!!!!!!!!Y&7!!!!!!!!!!!!!!!!!!77JY5PPP5YJ?7!!!!!!!!!!!!!!!!!!!BG!!!!!!!!!Y
             B!!!!!!!!!!P#Y7!!!!!!!!!!!!7JY5P5YJ????JJY5PP5J?!!!!!!!!!!!!!JBG7!!!!!!!!!J
             B!!!!!!!!!!!?PG5J?7777?JY5PPYJ7!!!!!!!!!!!!!7J5PPPYJ?77!77?5GBY!!!!!!!!!!!5
              J!!!!!!!!!!!!7JY555555YJ?7!!!!!!!!!!!!!!!!!!!!!7?JY5555555Y?!!!!!!!!!!!!!#
              #?!!!!!!!!!!!!!!!!!!!!!!!!!!!!7JYJJJ?JJJYY?!!!!!!!!!!!!!!!!!!!!!!!!!!!!!P
               &J!!!!!!!!!!!!!!!!!!!!!!!!!!!!7?JYYYYJ??7!!!!!!!!!!!!!!!!!!!!!!!!!!!!7G
                 G?!!!!!!!!!!!!!!!!!!!!!!!!!!!!!!!!!!!!!!!!!!!!!!!!!!!!!!!!!!!!!!!75&
                   BY?!!!!!!!!!!!!!!!!!!!!!!!!!!!!!!!!!!!!!!!!!!!!!!!!!!!!!!!!!7JG&
                      #PYJ?7!!!!!!!!!!!!!!!!!!!!!!!!!!!!!!!!!!!!!!!!!!!!!77?YPB&
  &BPPB              &Y7JYYYJ7!!!!!!!!!!!!!!!!!!!!!!!!!!!!!!!!!!!!!!!!!7?YYYJ??B
 #?!!!!?P           B7!!!!!!!!!!!!!!!!!!!!!!!!!!!!!!!!!!!!!!!!!!!!!!!!!!!!!!!!!!5
 Y!!!!!!!?B        P!!!!!!!!7!!!!!!!!!!!!!!!!!!!!!!!!!!!!!!!!!!!!!!!!!!!!!!!!!!!!Y
 Y!!!!!!!!!Y&     P!!!!!!!!!5Y!!!!!!!!!!!!!!!!!!!!!!!!!!!!!!!!!!!!!!!!!?Y7!!!!!!!!Y
 5!!!!!!!!!!7G   G!!!!!!!!!!75GY7!!!!!!!!!!!!!!!!!!!!!!!!!!!!!!!!!!!!?PP?!!!!!!!!!!5
 #!!!!!!!!!!!!Y&#7!!!!!!!!!!!!?5GPY7!!!!!!!!!!!!!!!!!!!!!!!!!!!!!7?5GPJ!!!!!!!!!!!!!G
  J!!!!!!!!!!!7&Y!!!!!!!!!!!!!!!7J5GPY?7!!!!!!!!!!!!!!!!!!!!!!7JPGPJ7!!!!!!!!!!!!!!!7&
  #7!!!!!!!!!!5#!!!!!!!!!!!!!!!!!!!!?Y5PPY?!!!!!!!!!!!!!!!7J5PPY?7!!!!!!!!!!!!!!!!!!!5
   G!!!!!!!!!7&Y!!!!!!!!!!!!!!!!!!!!!!!!?YGG7!!!!!!!!!!!!5BPJ7!!!!!!!!!!!!!!!!!7!!!!!7&
    P!!!!!!!!J&7!!!!!?P5?!!!!!!!!!!!!!!!!!!P&7!!!!!!!!!!P#7!!!!!!!!!!!!!!!!!7YPY!!!!!!B
     P!!!!!!!5#!!!!!!!7YGG5?7!!!!!!!!!!!!!!G#7!!!!!!!!!!P&7!!!!!!!!!!!!!!?YPBP?!!!!!!!P
      B7!!!!!PB!!!!!!!!!!?YPGP5J??777777J5GP7!!!!!!!!!!!7P#PJ?77!777?JYPGGPJ7!!!!!!!!!5
       &J!!!!PB!!!!!!!!!!!!!!?J5PPPPPPPP5Y7!!!!!!!!!!!!!!!7YPGGPPPPPP5YJ7!!!!!!!!!!!!!5
         P7!!5#!!!!!!!!!!!!!!!!!!!!!!!!!!!!!!!!!7!!!!!!!!!!!!!!!7!!!!!!!!!!!!!!!!!!!!!P
          &5!? ?!!!!!!!!!!!!!!!!!!!!!!!!!!!!!!!!YPY5Y!!!!!!!!!!!!!!!!!!!!!!!!!!!!!!!!!B
            #Y#G!!!!!!!!!!!!!!!!!!!!!!!!!!!!!!!75P5GJ!!!!!!!!!!!!!!!!!!!!!!!!!!!!!!!!?
                ?!!!!!!!!!!!!!!!!!!!!!!!!!!!!!!!7!!77!!!!!!!!!!!!!!!!!!!!!!!!!!!!!!!7#
       &##BGPP557!!!!!!!!!!!!!!!!!!!!!!!!!!!!!!!!!!!!!!!!!!!!!!!!!!!!!!!!!!!!!!!!!!!7Y5PPGBB#&
   &PJ?77!!!!!!!!!!!!!!!!!!!!!!!!!!!!!!!!!!!!!!!!!!!!!!!!!!!!!!!!!!!!!!!!!!!!!!!!!!!!!!!!!!!!7?J5#
  &?!!!!!!!!!!!!!!!!!!!!!!!!!!!!!!!!!!!!!!!!!!!!!!!!!!!!!!!!!!!!!!!!!!!!!!!!!!!!!!!!!!!!!!!!!!!!!!B
  B!!!!!!!!!!!!!!!!!!!!!!!!!!!!!!!!!!!!!!!!!!!!!!!!!!!!!!!!!!!!!!!!!!!!!!!!!!!!!!!!!!!!!!!!!!!!!!!5
  &?!!!!!!!!!!!!!!!!!!!!!!!!!!!!!!!!!!!!!!!!!!!!!!!!!!!!!!!!!!!!!!!!!!!!!!!!!!!!!!!!!!!!!!!!!!!!!!B
   #J!!!!!!!!!!!!!!!!!!!!!!!!!!!!!!7777????JJJJJJJYYYYJJJJJJJ????7777!!!!!!!!!!!!!!!!!!!!!!!!!!!7G
     GJ?7!!!!!!!!!777??JJY55PGGBB##&&&&                          &&&##BBGPP5YJ??777!!!!!!!!!!7?5#
       &#BBGGGGBB##&&                                                           &&#BBGGPPPGGB#···
                               ..|''||     .     .
                              .|'    ||  .||.  .||.    ....  ... ..
                              ||      ||  ||    ||   .|...||  ||' ''
                              '|.     ||  ||    ||   ||       ||
                               ''|...|'   '|.'  '|.'  '|...' .||.·
CREATE my-project/angular.json (193 bytes)
CREATE my-project/package.json (1030 bytes)
CREATE my-project/README.md (1090 bytes)
CREATE my-project/tsconfig.json (889 bytes)
CREATE my-project/.editorconfig (290 bytes)
CREATE my-project/.gitignore (590 bytes)
CREATE my-project/.vscode/extensions.json (134 bytes)
CREATE my-project/.vscode/launch.json (490 bytes)
CREATE my-project/.vscode/tasks.json (980 bytes)
    Directory is already under version control. Skipping initialization of git.·
added 32 packages, and changed 1 package in 2s
,- Installing packages (npm)...
✔ Packages installed successfully.
- Determining package manager...
ℹ Using package manager: npm
- Loading package information from registry...
✖ Unable to fetch package information for '@o3r/core@999.0.1715052731233': No matching version found for @o3r/core@999.0.1715052731233.
npm ERR! code 3
npm ERR! path D:\\a\\otter\\it-tests\\test-create-app1
npm ERR! command failed
npm ERR! command C:\\Windows\\system32\\cmd.exe /d /s /c create my-project --package-manager npm --skip-confirmation --exact-o3r-version --yarn-version 4.2.1·
npm ERR! A complete log of this run can be found in: D:\\a\\otter\\otter\\.cache\\test-app\\npm-cache\\_logs\\2024-05-08T21_45_50_904Z-debug-0.log
"

      81 |     // Yarn doesn't log errors on stderr, so we need to get them from stdout to have them in the reports
      82 |     // eslint-disable-next-line @typescript-eslint/restrict-template-expressions
    > 83 |     throw new Error(`Command failed: ${args.join(' ') }\nSTDERR:\n${err.stderr?.toString() || ''}\nOUTPUT:\n${err.output?.toString() || ''}`);
         |           ^
      84 |   }
      85 | }
      86 |

      at execCmd (packages/@o3r/test-helpers/src/utilities/package-manager.ts:83:11)
      at packageManagerCreate (packages/@o3r/test-helpers/src/utilities/package-manager.ts:105:10)
      at packages/@o3r/create/src/index.it.spec.ts:60:38
      at Object.<anonymous> (.yarn/cache/expect-npm-29.7.0-62e9f7979e-63f97bc51f.zip/node_modules/expect/build/toThrowMatchers.js:74:11)
      at Object.throwingMatcher [as toThrow] (.yarn/cache/expect-npm-29.7.0-62e9f7979e-63f97bc51f.zip/node_modules/expect/build/index.js:320:21)
      at Object.<anonymous> (packages/@o3r/create/src/index.it.spec.ts:60:160)
    at Object.<anonymous> (D:\a\otter\otter\packages\@o3r\create\src\index.it.spec.ts:60:160)